1

Closed

LINK : fatal error LNK1181: cannot open input file '...\Ribbon\Samples\CS\01-AddingRibbonSupport\RibbonMarkup.res'

description

I have a error of compilation:
 
------ Rebuild All started: Project: Ribbon, Configuration: Debug Any CPU ------
Ribbon -> \Ribbon\Ribbon\bin\Debug\Ribbon.dll
------ Rebuild All started: Project: 01-AddingRibbonSupport, Configuration: Debug Any CPU ------
The system cannot find the path specified.
The system cannot find the path specified.
Setting environment for using Microsoft Visual Studio 2010 x86 tools.
Microsoft (R) Incremental Linker Version 10.00.30319.01
Copyright (C) Microsoft Corporation. All rights reserved.


Starting pass 1
LINK : fatal error LNK1181: cannot open input file '\Ribbon\Samples\CS\01-AddingRibbonSupport\RibbonMarkup.res'
C:\Windows\Microsoft.NET\Framework\v4.0.30319\Microsoft.Common.targets(902,9): error MSB3073: The command ""%PROGRAMFILES%\Microsoft SDKs\Windows\v7.0\Bin\UICC.exe" "\Ribbon\Samples\CS\01-AddingRibbonSupport\RibbonMarkup.xml" "Ribbon\Samples\CS\01-AddingRibbonSupport\RibbonMarkup.bml" /res:"\Ribbon\Samples\CS\01-AddingRibbonSupport\RibbonMarkup.rc"
C:\Windows\Microsoft.NET\Framework\v4.0.30319\Microsoft.Common.targets(902,9): error MSB3073: "%PROGRAMFILES%\Microsoft SDKs\Windows\v7.0\Bin\rc.exe" /v "\Ribbon\Samples\CS\01-AddingRibbonSupport\RibbonMarkup.rc"
C:\Windows\Microsoft.NET\Framework\v4.0.30319\Microsoft.Common.targets(902,9): error MSB3073: cmd /c "("c:\Program Files (x86)\Microsoft Visual Studio 10.0\Common7\IDE....\VC\bin\vcvars32.bat") && ("c:\Program Files (x86)\Microsoft Visual Studio 10.0\Common7\IDE....\VC\bin\link.exe" /VERBOSE /NOENTRY /DLL /OUT:"\Ribbon\Samples\CS\01-AddingRibbonSupport\bin\Debug\01-AddingRibbonSupport.ribbon.dll" "\Ribbon\Samples\CS\01-AddingRibbonSupport\RibbonMarkup.res")"
C:\Windows\Microsoft.NET\Framework\v4.0.30319\Microsoft.Common.targets(902,9): error MSB3073: " exited with code 1181.
========== Rebuild All: 1 succeeded, 1 failed, 0 skipped ==========
Closed Oct 9, 2010 at 12:03 AM by arik
Not a bug. Solved in comments.

comments

arik wrote Jun 20, 2010 at 4:38 PM

Your system cannot find the uicc.exe and rc.exe files.
Make sure you have installed Windows 7 SDK.

Also, if you run on 64bit OS, check this: http://windowsribbon.codeplex.com/Thread/View.aspx?ThreadId=77456

Neolig wrote Jun 20, 2010 at 6:56 PM

Thank you!
Now everything great!!!

wrote Oct 9, 2010 at 12:03 AM

wrote Feb 22, 2013 at 12:15 AM

wrote May 16, 2013 at 11:57 AM